Target
Dimer of Gag-Pol polyprotein [489-587]
Ligand
BDBM763
Substrate
Peptide Substrate
Meas. Tech.
Protease Inhibition Assay
pH
5±n/a
Temperature
295.15±n/a K
Ki
3.2±n/a nM
Citation
 Skulnick, HIJohnson, PDAristoff, PAMorris, JKLovasz, KDHowe, WJWatenpaugh, KDJanakiraman, MNAnderson, DJReischer, RJSchwartz, TMBanitt, LSTomich, PKLynn, JCHorng, MMChong, KTHinshaw, RRDolak, LASeest, EPSchwende, FJRush, BDHoward, GMToth, LNWilkinson, KRRomines, KR Structure-based design of nonpeptidic HIV protease inhibitors: the sulfonamide-substituted cyclooctylpyramones. J Med Chem 40:1149-64 (1997)  
Target
Name:
Dimer of Gag-Pol polyprotein [489-587]
Synonyms:
HIV-1 Protease
Type:
Protein Complex
Mol. Mass.:
Description:
Components:
This complex has 2 components.
Component 1
Name:
Gag-Pol polyprotein [489-587]
Synonyms:
HIV protease HIV-1 Protease chain A POL_HV1N5 | gag-pol
Type:
Enzyme Subunit
Mol. Mass.:
10822.21
Organism:
Human immunodeficiency virus type 1
Description:
P12497[489-587]
Residue:
99
  
Component 2
Name:
Gag-Pol polyprotein [489-587]
Synonyms:
HIV protease HIV-1 Protease chain A POL_HV1N5 | gag-pol
Type:
Enzyme Subunit
Mol. Mass.:
10822.21
Organism:
Human immunodeficiency virus type 1
Description:
P12497[489-587]
Residue:
99
  
Inhibitor
Name:
BDBM763
Synonyms:
Cyclooctylpyranonesulfonamide deriv. 8b Sulfonamide-Substituted Cyclooctylpyranone deriv. 8h | U-103017 Analog
Type:
Small organic molecule
Emp. Form.:
C27H29NO5S
Mol. Mass.:
479.588
SMILES:
Oc1c2CCCCCCc2oc(=O)c1[C@@H](C1CC1)c1cccc(NS(=O)(=O)c2ccccc2)c1
:
Substrate
Name:
Peptide Substrate
Synonyms:
Type:
Peptide
Mol. Mass.:
1447.64
Organism:
Description:
The peptide was derivatized with biotin and fluorescein isothiocyanate at the amino and carboxy termini.
Residue:
12
RVSQNYPIVQNK