Target
Dimer of Gag-Pol polyprotein [489-587]
Ligand
BDBM1488
Substrate
Peptide Substrate
Meas. Tech.
Protease Inhibition Assay
Ki
1.9±n/a nM
Citation
 Skulnick, HIJohnson, PDAristoff, PAMorris, JKLovasz, KDHowe, WJWatenpaugh, KDJanakiraman, MNAnderson, DJReischer, RJSchwartz, TMBanitt, LSTomich, PKLynn, JCHorng, MMChong, KTHinshaw, RRDolak, LASeest, EPSchwende, FJRush, BDHoward, GMToth, LNWilkinson, KRRomines, KR Structure-based design of nonpeptidic HIV protease inhibitors: the sulfonamide-substituted cyclooctylpyramones. J Med Chem 40:1149-64 (1997)  
Target
Name:
Dimer of Gag-Pol polyprotein [489-587]
Synonyms:
HIV-1 Protease
Type:
Protein Complex
Mol. Mass.:
Description:
Components:
This complex has 2 components.
Component 1
Name:
Gag-Pol polyprotein [489-587]
Synonyms:
HIV protease HIV-1 Protease chain A POL_HV1N5 | gag-pol
Type:
Enzyme Subunit
Mol. Mass.:
10822.21
Organism:
Human immunodeficiency virus type 1
Description:
P12497[489-587]
Residue:
99
  
Component 2
Name:
Gag-Pol polyprotein [489-587]
Synonyms:
HIV protease HIV-1 Protease chain A POL_HV1N5 | gag-pol
Type:
Enzyme Subunit
Mol. Mass.:
10822.21
Organism:
Human immunodeficiency virus type 1
Description:
P12497[489-587]
Residue:
99
  
Inhibitor
Name:
BDBM1488
Synonyms:
N-[3-[Cyclopropyl(5,6,7,8,9,10-hexahydro-4-hydroxy-2-oxo-2H-cycloocta[b]pyran-3-yl)methyl]phenyl]-8-quinolinesulfonamide Sulfonamide-Substituted Cyclooctylpyranone deriv. 37b
Type:
Small organic molecule
Emp. Form.:
C30H30N2O5S
Mol. Mass.:
530.635
SMILES:
Oc1c2CCCCCCc2oc(=O)c1C(C1CC1)c1cccc(NS(=O)(=O)c2cccc3cccnc23)c1
:
Substrate
Name:
Peptide Substrate
Synonyms:
Type:
Peptide
Mol. Mass.:
1447.64
Organism:
Description:
The peptide was derivatized with biotin and fluorescein isothiocyanate at the amino and carboxy termini.
Residue:
12
RVSQNYPIVQNK