Target
Wee1-like protein kinase
Ligand
BDBM264271
Substrate
Meas. Tech.
Wee-1 kinase Assay
Temperature
298.15±n/a K
IC50
105±n/a nM
Comments
extracted
Citation
 O Dowd, CRRountree, JSBurkamp, FWilkinson, AJ Substituted pyrido[4,3-d]pyrimidines as Wee-1 inhibitors US Patent  US9714244 Publication Date 7/25/2017 
Target
Name:
Wee1-like protein kinase
Synonyms:
Serine/threonine-protein kinase WEE1 WEE1 homolog (S. pombe) | WEE1_HUMAN
Type:
PROTEIN
Mol. Mass.:
71599.12
Organism:
Homo sapiens (Human)
Description:
ChEMBL_1445054
Residue:
646
  
Inhibitor
Name:
BDBM264271
Synonyms:
2-((3-(Aminomethyl)phenyl)amino)-6-(2,6-dichlorophenyl)pyrido[4,3-d]pyrimidin-5(6H)-one | US9714244, 25
Type:
Small organic molecule
Emp. Form.:
C20H15Cl2N5O
Mol. Mass.:
412.272
SMILES:
NCc1cccc(Nc2ncc3c(ccn(-c4c(Cl)cccc4Cl)c3=O)n2)c1
: