Target
Mitogen-activated protein kinase 14
Ligand
BDBM50110208
Substrate
Meas. Tech.
Kinase Inhibitor Selectivity Profiling Assay
Kd
170±n/a nM
Citation
 PubChem, PC Kinase Inhibitor Selectivity Profiling Assay PubChem Bioassay (2008)[AID] 
Target
Name:
Mitogen-activated protein kinase 14
Synonyms:
CSAID-binding protein CSBP1 CSPB1 MAP kinase 14 MAP kinase p38 alpha MAPK14 MK14_HUMAN Mitogen-activated protein kinase p38 alpha Stress-activated protein kinase 2a | p38 MAP kinase alpha/beta
Type:
Serine/threonine-protein kinase
Mol. Mass.:
41286.76
Organism:
Homo sapiens (Human)
Description:
Q16539
Residue:
360
  
Inhibitor
Name:
BDBM50110208
Synonyms:
4-(4-(benzo[d][1,3]dioxol-5-yl)-5-(pyridin-2-yl)-1H-imidazol-2-yl)benzamide 4-(5-(benzo[d][1,3]dioxol-5-yl)-4-(pyridin-2-yl)-1H-imidazol-2-yl)benzamide CHEMBL440084 cid_4521392
Type:
Small organic molecule
Emp. Form.:
C22H16N4O3
Mol. Mass.:
384.3874
SMILES:
NC(=O)c1ccc(cc1)-c1nc(c([nH]1)-c1ccc2OCOc2c1)-c1ccccn1
: