Target
Alpha-1,6-mannosyl-glycoprotein 2-beta-N-acetylglucosaminyltransferase
Ligand
BDBM403549
Substrate
Meas. Tech.
Measurement of Human MGAT2 Inhibitory Activity
IC50
1.10±n/a nM
Citation
 Nishiura, YKurahashi, KOhyabu, NSasaki, Y Non-aromatic heterocyclic derivative having MGAT2 inhibitory activity US Patent  US10335401 Publication Date 7/2/2019 
Target
Name:
Alpha-1,6-mannosyl-glycoprotein 2-beta-N-acetylglucosaminyltransferase
Synonyms:
2.4.1.143 GNT-II MGAT2 Mannoside acetylglucosaminyltransferase 2 Monoacylglycerol acyltransferase type 2 (h-MGAT2) h-MGAT2 (human monoacylglycerol acyltransferase type 2)
Type:
Mol. Mass.:
51567.80
Organism:
Homo sapiens (Human)
Description:
Q10469
Residue:
447
  
Inhibitor
Name:
BDBM403549
Synonyms:
US10335401, No. I-59
Type:
Small organic molecule
Emp. Form.:
C26H25F8N3O5S
Mol. Mass.:
643.546
SMILES:
CS(=O)(=O)CC(=O)NCC1=C(C[C@](NC1=O)(c1ccc(OCCCC(F)(F)F)cc1)C(F)(F)F)c1ccc(cn1)C(F)F
: