Target
Genome polyprotein
Ligand
BDBM403618
Substrate
Meas. Tech.
Ki Determination for Genotypes 1b and 3a NS3 Protease
Ki
0.030±n/a nM
Citation
 Bjornson, KCanales, ECottell, JJKarki, KKKatana, AAKato, DKobayashi, TLink, JOMartinez, RPhillips, BWPyun, HSangi, MSchrier, AJSiegel, DTaylor, JGTran, CVTrejo Martin, TAVivian, RWYang, ZZablocki, JZipfel, S Inhibitors of hepatitis C virus US Patent  US10335409 Publication Date 7/2/2019 
Target
Name:
Genome polyprotein
Synonyms:
HCV Polymerase (S282T) NS3/4A Protein POLG_HCVJA
Type:
Protein
Mol. Mass.:
327076.78
Organism:
Hepatitis C Virus (Virus)
Description:
P26662
Residue:
3010
  
Inhibitor
Name:
BDBM403618
Synonyms:
(3aR,7S,10S,11S,12R,24aR)-7-tert-butyl-N-[(1R,2R)-1-[(cyclopropylsulfonyl)carbamoyl]-2-(difluoromethyl)cyclopropyl]-16-methoxy-11-methyl-5,8-dioxo-1,2,3,3a,5,6,7,8,11,12,20,21,22,23,24,24a-hexadecahydro-10H-9,12-methanocyclopenta[18,19][1,10,3,6]dioxadiazacyclononadecino[11,12-b]quinoxaline-10-carboxamide | US10335409, Example 28
Type:
Small organic molecule
Emp. Form.:
C40H54F2N6O9S
Mol. Mass.:
832.953
SMILES:
COc1ccc2nc3CCCCC[C@@H]4CCC[C@H]4OC(=O)N[C@H](C(=O)N4C[C@H](Oc3nc2c1)[C@@H](C)[C@H]4C(=O)N[C@@]1(C[C@H]1C(F)F)C(=O)NS(=O)(=O)C1CC1)C(C)(C)C
: