Target
Genome polyprotein
Ligand
BDBM403635
Substrate
Meas. Tech.
Ki Determination for Genotypes 1b and 3a NS3 Protease
Ki
0.040±n/a nM
Citation
 Bjornson, KCanales, ECottell, JJKarki, KKKatana, AAKato, DKobayashi, TLink, JOMartinez, RPhillips, BWPyun, HSangi, MSchrier, AJSiegel, DTaylor, JGTran, CVTrejo Martin, TAVivian, RWYang, ZZablocki, JZipfel, S Inhibitors of hepatitis C virus US Patent  US10335409 Publication Date 7/2/2019 
Target
Name:
Genome polyprotein
Synonyms:
HCV Polymerase (S282T) NS3/4A Protein POLG_HCVJA
Type:
Protein
Mol. Mass.:
327076.78
Organism:
Hepatitis C Virus (Virus)
Description:
P26662
Residue:
3010
  
Inhibitor
Name:
BDBM403635
Synonyms:
(1aS,5S,8S,9S,10R,22aS)-5-tert-butyl-N-[(1R,2R)-2-(difluoromethyl)-1-{[(1-methylcyclopropyl)sulfonyl]carbamoyl}cyclopropyl]-14-methoxy-1a,9-dimethyl-3,6-dioxo-1,1a,3,4,5,6,9,10,18,19,20,21,22,22a-tetradecahydro-8H-7,10-methanocyclopropa[18,19][1,10,3,6]dioxadiazacyclononadecino[11,12-b]quinoxaline-8-carboxamide | US10335409, Example 45
Type:
Small organic molecule
Emp. Form.:
C40H54F2N6O9S
Mol. Mass.:
832.953
SMILES:
COc1ccc2nc3CCCCC[C@H]4C[C@]4(C)OC(=O)N[C@H](C(=O)N4C[C@H](Oc3nc2c1)[C@@H](C)[C@H]4C(=O)N[C@@]1(C[C@H]1C(F)F)C(=O)NS(=O)(=O)C1(C)CC1)C(C)(C)C
: