Target
Genome polyprotein
Ligand
BDBM403670
Substrate
Meas. Tech.
Ki Determination for Genotypes 1b and 3a NS3 Protease
Ki
0.040±n/a nM
Citation
 Bjornson, KCanales, ECottell, JJKarki, KKKatana, AAKato, DKobayashi, TLink, JOMartinez, RPhillips, BWPyun, HSangi, MSchrier, AJSiegel, DTaylor, JGTran, CVTrejo Martin, TAVivian, RWYang, ZZablocki, JZipfel, S Inhibitors of hepatitis C virus US Patent  US10335409 Publication Date 7/2/2019 
Target
Name:
Genome polyprotein
Synonyms:
HCV Polymerase (S282T) NS3/4A Protein POLG_HCVJA
Type:
Protein
Mol. Mass.:
327076.78
Organism:
Hepatitis C Virus (Virus)
Description:
P26662
Residue:
3010
  
Inhibitor
Name:
BDBM403670
Synonyms:
(1aS,2aR,6S,9S,10S,11R,23aR,23bS)-6-tert-butyl-N-[(1R,2R)-2-(difluoromethyl)-1-{[(1-methylcyclopropyl)sulfonyl]carbamoyl}cyclopropyl]-19,19-difluoro-15-methoxy-10-methyl-4,7-dioxo-1a,2,2a,4,5,6,7,10,11,19,20,21,22,23,23a,23b-hexadecahydro-1H,9H-8,11-methanocyclopropa[4′,5′]cyclopenta[1′,2′:18,19][1,10,3,6]dioxadiazacyclononadecino[11,12-b]quinoxaline-9-carboxamide | US10335409, Example 81
Type:
Small organic molecule
Emp. Form.:
C42H54F4N6O9S
Mol. Mass.:
894.972
SMILES:
COc1ccc2nc3c(O[C@H]4CN([C@@H]([C@@H]4C)C(=O)N[C@@]4(C[C@H]4C(F)F)C(=O)NS(=O)(=O)C4(C)CC4)C(=O)[C@@H](NC(=O)O[C@@H]4C[C@@H]5C[C@@H]5[C@H]4CCCCC3(F)F)C(C)(C)C)nc2c1
: