Target
fMet-Leu-Phe receptor
Ligand
BDBM37725
Substrate
Meas. Tech.
Dose Response Assay for Formylpeptide Receptor (FPR) Ligands and Dose Response Counter-Screen Assay for Formylpeptide-Like-1 (FPRL1) Ligands
Ki
6100±n/a nM
Citation
 PubChem, PC Dose Response Assay for Formylpeptide Receptor (FPR) Ligands and Dose Response Counter-Screen Assay for Formylpeptide-Like-1 (FPRL1) Ligands PubChem Bioassay (2007)[AID] 
Target
Name:
fMet-Leu-Phe receptor
Synonyms:
FPR FPR1_HUMAN N-formyl peptide receptor 1 fMLP receptor formyl peptide receptor 1
Type:
Enzyme Catalytic Domain
Mol. Mass.:
38456.14
Organism:
Homo sapiens (Human)
Description:
gi_4503779
Residue:
350
  
Inhibitor
Name:
BDBM37725
Synonyms:
2-[[3-(5-chloranyl-2-methoxy-phenyl)-7-oxidanylidene-2-sulfanylidene-4H-[1,3]thiazolo[4,5-d]pyrimidin-5-yl]sulfanyl]-N-(oxolan-2-ylmethyl)ethanamide 2-[[3-(5-chloro-2-methoxyphenyl)-7-oxo-2-sulfanylidene-4H-[1,3]thiazolo[4,5-d]pyrimidin-5-yl]sulfanyl]-N-(oxolan-2-ylmethyl)acetamide 2-{[3-(5-chloro-2-methoxyphenyl)-7-oxo-2-thioxo-2,3,6,7-tetrahydro[1,3]thiazolo[4,5-d]pyrimidin-5-yl]thio}-N-(tetrahydrofuran-2-ylmethyl)acetamide SMR000031034 | cid_3241209
Type:
Small organic molecule
Emp. Form.:
C19H19ClN4O4S3
Mol. Mass.:
499.027
SMILES:
COc1ccc(Cl)cc1-n1c2nc(SCC(=O)NCC3CCCO3)[nH]c(=O)c2sc1=S
: