Target
M-phase inducer phosphatase 2
Ligand
BDBM32097
Substrate
Meas. Tech.
Cdc25B Catalytic Domain Protein Tyrosine Phosphatase Probe Assessment Dose Response Reproducibility Assay
IC50
24251±n/a nM
Citation
 PubChem, PC Cdc25B Catalytic Domain Protein Tyrosine Phosphatase Probe Assessment Dose Response Reproducibility Assay PubChem Bioassay (2007)[AID] 
Target
Name:
M-phase inducer phosphatase 2
Synonyms:
CDC25B Dual specificity phosphatase (CDC25B) M-phase inducer phosphatase 2 (CDC25B) | MPIP2_HUMAN
Type:
Protein
Mol. Mass.:
64985.27
Organism:
Homo sapiens (Human)
Description:
Residue:
580
  
Inhibitor
Name:
BDBM32097
Synonyms:
5-isoquinolinamine MLS000090034 cid_70766 | isoquinolin-5-amine
Type:
Small organic molecule
Emp. Form.:
C9H8N2
Mol. Mass.:
144.1732
SMILES:
Nc1cccc2cnccc12
: