Target
Beta-lactamase
Ligand
BDBM50115620
Substrate
Meas. Tech.
Enzyme Inhibition Assay
pH
7±0
Ki
150±n/a nM
Citation
 Caselli, EPowers, RABlasczcak, LCWu, CYPrati, FShoichet, BK Energetic, structural, and antimicrobial analyses of beta-lactam side chain recognition by beta-lactamases. Chem Biol 8:17-31 (2001)  
Target
Name:
Beta-lactamase
Synonyms:
AMPC_ECOLI Beta-lactamase (AmpC) Cephalosporinase ampA | ampC
Type:
Protien
Mol. Mass.:
41561.62
Organism:
Escherichia coli
Description:
P00811
Residue:
377
  
Inhibitor
Name:
BDBM50115620
Synonyms:
3-(2-Chloro-phenyl)-5-methyl-2,3-dihydro-isoxazole-4-carboxylic acid dihydroxyboranylmethyl-amide CHEMBL324688 | N-[5-METHYL-3-O-TOLYL-ISOXAZOLE-4-CARBOXYLIC ACID AMIDE] BORONIC ACID
Type:
Small organic molecule
Emp. Form.:
C12H12BClN2O4
Mol. Mass.:
294.499
SMILES:
Cc1onc(c1C(=O)NCB(O)O)-c1ccccc1Cl
: