Target
Beta-lactamase
Ligand
BDBM39809
Substrate
Meas. Tech.
Enzyme Inhibition Assay
pH
7±0
Ki
1.38e+4±n/a nM
Citation
 Caselli, EPowers, RABlasczcak, LCWu, CYPrati, FShoichet, BK Energetic, structural, and antimicrobial analyses of beta-lactam side chain recognition by beta-lactamases. Chem Biol 8:17-31 (2001)  
Target
Name:
Beta-lactamase
Synonyms:
BLAC_STAAU Penicillinase | blaZ
Type:
PROTEIN
Mol. Mass.:
31367.53
Organism:
Staphylococcus aureus
Description:
ChEMBL_41052
Residue:
281
  
Inhibitor
Name:
BDBM39809
Synonyms:
Acylglycineboronic acid, 6
Type:
Small organic molecule
Emp. Form.:
C9H12BNO3
Mol. Mass.:
193.007
SMILES:
OB(O)CNC(=O)Cc1ccccc1
: