Target
fMet-Leu-Phe receptor
Ligand
BDBM40413
Substrate
Meas. Tech.
Formylpeptide Receptor (FPR) Ligand Structure Activity Relationship (SAR) Analysis : Dose Response Assay
Ki
3300±n/a nM
Citation
 PubChem, PC Formylpeptide Receptor (FPR) Ligand Structure Activity Relationship (SAR) Analysis : Dose Response Assay PubChem Bioassay (2007)[AID] 
Target
Name:
fMet-Leu-Phe receptor
Synonyms:
FPR FPR1_HUMAN N-formyl peptide receptor 1 fMLP receptor formyl peptide receptor 1
Type:
Enzyme Catalytic Domain
Mol. Mass.:
38456.14
Organism:
Homo sapiens (Human)
Description:
gi_4503779
Residue:
350
  
Inhibitor
Name:
BDBM40413
Synonyms:
2-furancarboxylic acid [3-(3,4-dimethoxyphenyl)-4-oxo-2-(trifluoromethyl)-1-benzopyran-7-yl] ester [3-(3,4-dimethoxyphenyl)-4-oxidanylidene-2-(trifluoromethyl)chromen-7-yl] furan-2-carboxylate cid_1036463 | furan-2-carboxylic acid [3-(3,4-dimethoxyphenyl)-4-keto-2-(trifluoromethyl)chromen-7-yl] ester
Type:
Small organic molecule
Emp. Form.:
C23H15F3O7
Mol. Mass.:
460.3562
SMILES:
COc1ccc(cc1OC)-c1c(oc2cc(OC(=O)c3ccco3)ccc2c1=O)C(F)(F)F
: