Target
fMet-Leu-Phe receptor
Ligand
BDBM40420
Substrate
Meas. Tech.
Formylpeptide Receptor (FPR) Ligand Structure Activity Relationship (SAR) Analysis : Dose Response Assay
Ki
4700±n/a nM
Citation
 PubChem, PC Formylpeptide Receptor (FPR) Ligand Structure Activity Relationship (SAR) Analysis : Dose Response Assay PubChem Bioassay (2007)[AID] 
Target
Name:
fMet-Leu-Phe receptor
Synonyms:
FPR FPR1_HUMAN N-formyl peptide receptor 1 fMLP receptor formyl peptide receptor 1
Type:
Enzyme Catalytic Domain
Mol. Mass.:
38456.14
Organism:
Homo sapiens (Human)
Description:
gi_4503779
Residue:
350
  
Inhibitor
Name:
BDBM40420
Synonyms:
1-(3-imidazol-1-ylpropyl)-2-(4-methoxyphenyl)-4-oxidanyl-3-thiophen-2-ylcarbonyl-2H-pyrrol-5-one 4-hydroxy-1-(3-imidazol-1-ylpropyl)-2-(4-methoxyphenyl)-3-(thiophene-2-carbonyl)-2H-pyrrol-5-one UNM000003552401 | cid_2907867
Type:
Small organic molecule
Emp. Form.:
C22H21N3O4S
Mol. Mass.:
423.485
SMILES:
COc1ccc(cc1)C1C(C(=O)c2cccs2)C(=O)C(=O)N1CCCn1ccnc1
: