Target
Nuclear receptor subfamily 4 group A member 1
Ligand
BDBM34678
Substrate
Meas. Tech.
High Throughput Fluorescence Polarization Screen for Bcl-B Phenotype Converters
IC50
39466±2820 nM
Citation
 PubChem, PC High Throughput Fluorescence Polarization Screen for Bcl-B Phenotype Converters PubChem Bioassay (2008)[AID] 
Target
Name:
Nuclear receptor subfamily 4 group A member 1
Synonyms:
GFRP1 NAK1 NR4A1_HUMAN | nuclear receptor subfamily 4, group A, member 1
Type:
Enzyme Catalytic Domain
Mol. Mass.:
64467.13
Organism:
Homo sapiens (Human)
Description:
gi_27894344
Residue:
598
  
Inhibitor
Name:
BDBM34678
Synonyms:
2-(1-phenyl-1H-pyrazol-4-yl)-1-(2,3,4-trihydroxyphenyl)ethanone 2-(1-phenylpyrazol-4-yl)-1-(2,3,4-trihydroxyphenyl)ethanone MLS000530746 cid_805519
Type:
Small organic molecule
Emp. Form.:
C17H14N2O4
Mol. Mass.:
310.3041
SMILES:
Oc1ccc(C(=O)Cc2cnn(c2)-c2ccccc2)c(O)c1O
: