Target
Thymidylate synthase
Ligand
BDBM40768
Substrate
BDBM50028108
Meas. Tech.
Inhibition Assay
IC50
5.3e+4±n/a nM
Citation
 Fritz, TATondi, DFiner-Moore, JSCosti, MPStroud, RM Predicting and harnessing protein flexibility in the design of species-specific inhibitors of thymidylate synthase. Chem Biol 8:981-95 (2001)  
Target
Name:
Thymidylate synthase
Synonyms:
TSase Thymidylate Synthase (TS) thyA
Type:
Enzyme
Mol. Mass.:
36576.54
Organism:
Lactobacillus casei
Description:
Residue:
316
  
Inhibitor
Name:
BDBM40768
Synonyms:
5-dibutylamino-1-naphthylsulfonyl
Type:
Small organic molecule
Emp. Form.:
C27H34N2O5S
Mol. Mass.:
498.634
SMILES:
CCCCN(CCCC)c1cccc2c(cccc12)S(=O)(=O)Oc1ccc(CC(N)C(O)=O)cc1
:
Substrate
Name:
BDBM50028108
Synonyms:
2'-Deoxyuridinemonophosphate Phosphoric acid mono-[5-(2,4-dioxo-3,4-dihydro-2H-pyrimidin-1-yl)-3-hydroxy-tetrahydro-furan-2-ylmethyl] ester
Type:
Small organic molecule
Emp. Form.:
C9H13N2O8P
Mol. Mass.:
308.1819
SMILES:
O[C@H]1C[C@@H](O[C@@H]1COP(O)(O)=O)n1ccc(=O)[nH]c1=O
: