Target
Heat shock 70 kDa protein 1A
Ligand
BDBM31716
Substrate
Meas. Tech.
TR-FRET secondary assay for HTS discovery of chemical inhibitors of Hsp70
IC50
12400±1120 nM
Citation
 PubChem, PC TR-FRET secondary assay for HTS discovery of chemical inhibitors of Hsp70 PubChem Bioassay (2008)[AID] 
Target
Name:
Heat shock 70 kDa protein 1A
Synonyms:
HSPA1A V9GZ37_HUMAN | heat shock 70kDa protein 1A
Type:
ATP-binding protein
Mol. Mass.:
51937.99
Organism:
Homo sapiens (Human)
Description:
gi_123271505; GST-tagged ATPase domain
Residue:
476
  
Inhibitor
Name:
BDBM31716
Synonyms:
4-methylbenzoic acid (4-salicyloylazoanilino) ester MLS000521412 [4-[(2-hydroxybenzoyl)diazenyl]anilino] 4-methylbenzoate cid_4483669
Type:
Small organic molecule
Emp. Form.:
C21H17N3O4
Mol. Mass.:
375.3774
SMILES:
Cc1ccc(cc1)C(=O)ONc1ccc(cc1)\N=N\C(=O)c1ccccc1O
: