Target
Procathepsin L
Ligand
BDBM41132
Substrate
Meas. Tech.
Cathepsin L dose-response confirmation
IC50
>50000±0 nM
Citation
 PubChem, PC Cathepsin L dose-response confirmation PubChem Bioassay (2008)[AID] 
Target
Name:
Procathepsin L
Synonyms:
CATL1_HUMAN CTSL CTSL1 Cathepsin L Cathepsin L1 heavy chain MEP cathepsin L preproprotein
Type:
Enzyme
Mol. Mass.:
37557.19
Organism:
Homo sapiens (Human)
Description:
Purchased from Calbiochem (San Diego, CA).
Residue:
333
  
Inhibitor
Name:
BDBM41132
Synonyms:
MLS000028542 TRIAMCINOLONE | cid_31307
Type:
Small organic molecule
Emp. Form.:
C21H27FO6
Mol. Mass.:
394.4339
SMILES:
C[C@]12C[C@H](O)[C@@]3(F)[C@@H](CCC4=CC(=O)C=C[C@]34C)[C@@H]1C[C@@H](O)[C@]2(O)C(=O)CO
: