Target
Heat shock 70 kDa protein 1A
Ligand
BDBM41995
Substrate
Meas. Tech.
In Vitro Hsp70 Dose Response Fluorescence Polarization Assay for SAR Study
IC50
90600±7740 nM
Citation
 PubChem, PC In Vitro Hsp70 Dose Response Fluorescence Polarization Assay for SAR Study PubChem Bioassay (2008)[AID] 
Target
Name:
Heat shock 70 kDa protein 1A
Synonyms:
HSPA1A V9GZ37_HUMAN | heat shock 70kDa protein 1A
Type:
ATP-binding protein
Mol. Mass.:
51937.99
Organism:
Homo sapiens (Human)
Description:
gi_123271505; GST-tagged ATPase domain
Residue:
476
  
Inhibitor
Name:
BDBM41995
Synonyms:
9-nitro-3a,4,5,9b-tetrahydro-3H-cyclopenta[c]quinoline-4,6-dicarboxylic acid cid_2872935
Type:
Small organic molecule
Emp. Form.:
C14H12N2O6
Mol. Mass.:
304.2549
SMILES:
OC(=O)C1Nc2c(ccc(c2C2C=CCC12)[N+]([O-])=O)C(O)=O
: