Target
Heat shock 70 kDa protein 1A
Ligand
BDBM31733
Substrate
Meas. Tech.
In Vitro Hsp70 Dose Response Fluorescence Polarization Assay for SAR Study
IC50
2420±160 nM
Citation
 PubChem, PC In Vitro Hsp70 Dose Response Fluorescence Polarization Assay for SAR Study PubChem Bioassay (2008)[AID] 
Target
Name:
Heat shock 70 kDa protein 1A
Synonyms:
HSPA1A V9GZ37_HUMAN | heat shock 70kDa protein 1A
Type:
ATP-binding protein
Mol. Mass.:
51937.99
Organism:
Homo sapiens (Human)
Description:
gi_123271505; GST-tagged ATPase domain
Residue:
476
  
Inhibitor
Name:
BDBM31733
Synonyms:
3a,4,5,9b-tetrahydro-3H-cyclopenta[c]quinoline-4,8-dicarboxylic acid US11584714, Compound 28 | cid_4039540
Type:
Small organic molecule
Emp. Form.:
C14H13NO4
Mol. Mass.:
259.2573
SMILES:
OC(=O)C1Nc2ccc(cc2C2C=CCC12)C(O)=O
: