Target
Cytochrome P450 11B1, mitochondrial
Ligand
BDBM101398
Substrate
Meas. Tech.
Cellular Enzyme Assay
Temperature
310.15±n/a K
EC50
10910±n/a nM
Comments
extracted
Citation
 Aebi, JAmrein, KChen, WHornsperger, BKuhn, BLiu, YMaerki, HPMartin, REMayweg, ATan, XWang, LZhou, M 3,4-dihydro-2H-isoquinoline-1-one and 2,3-dihydro-isoindol-1-one compounds US Patent  US9695152 Publication Date 7/4/2017 
Target
Name:
Cytochrome P450 11B1, mitochondrial
Synonyms:
C11B1_HUMAN CYPXIB1 Cytochrome P450 11B1 Cytochrome P450 11B1, mitochondrial | S11BH
Type:
Enzyme
Mol. Mass.:
57591.44
Organism:
Homo sapiens (Human)
Description:
P15538
Residue:
503
  
Inhibitor
Name:
BDBM101398
Synonyms:
US9695152, 19
Type:
Small organic molecule
Emp. Form.:
C28H28ClN5O2
Mol. Mass.:
502.007
SMILES:
Cc1ccncc1C(=O)N1CC2(CC(C2)Nc2cncc(c2)N2C(=O)c3ccc(Cl)cc3C2(C)C)C1
: