Target
Neuropeptide Y receptor type 1
Ligand
BDBM42476
Substrate
Meas. Tech.
Dose response counterscreen for neuropeptide Y receptor Y2 (NPY-Y2): Cell-based high throughput assay to measure NPY-Y1 antagonism
IC50
12770±n/a nM
Citation
 PubChem, PC Dose response counterscreen for neuropeptide Y receptor Y2 (NPY-Y2): Cell-based high throughput assay to measure NPY-Y1 antagonism PubChem Bioassay (2008)[AID] 
Target
Name:
Neuropeptide Y receptor type 1
Synonyms:
NPY-Y1 NPY1R NPYR neuropeptide Y receptor Y1
Type:
Enzyme Catalytic Domain
Mol. Mass.:
44399.07
Organism:
Homo sapiens (Human)
Description:
NPY-Y1 NPY1R HUMAN::P25929
Residue:
384
  
Inhibitor
Name:
BDBM42476
Synonyms:
2-[(2-phenyl-1,3-thiazol-4-yl)methylsulfanyl]-5-thiophen-2-yl-1,3,4-oxadiazole 2-[(2-phenylthiazol-4-yl)methylthio]-5-(2-thienyl)-1,3,4-oxadiazole SMR000064095 | cid_2085549
Type:
Small organic molecule
Emp. Form.:
C16H11N3OS3
Mol. Mass.:
357.473
SMILES:
C(Sc1nnc(o1)-c1cccs1)c1csc(n1)-c1ccccc1
: