Target
Neuropeptide Y receptor type 1
Ligand
BDBM42484
Substrate
Meas. Tech.
Dose response counterscreen for neuropeptide Y receptor Y2 (NPY-Y2): Cell-based high throughput assay to measure NPY-Y1 antagonism
IC50
7817±n/a nM
Citation
 PubChem, PC Dose response counterscreen for neuropeptide Y receptor Y2 (NPY-Y2): Cell-based high throughput assay to measure NPY-Y1 antagonism PubChem Bioassay (2008)[AID] 
Target
Name:
Neuropeptide Y receptor type 1
Synonyms:
NPY-Y1 NPY1R NPYR neuropeptide Y receptor Y1
Type:
Enzyme Catalytic Domain
Mol. Mass.:
44399.07
Organism:
Homo sapiens (Human)
Description:
NPY-Y1 NPY1R HUMAN::P25929
Residue:
384
  
Inhibitor
Name:
BDBM42484
Synonyms:
5-chloranyl-2-(3,4-dihydro-1H-isochromen-3-ylmethyl)-3a,4,7,7a-tetrahydroisoindole-1,3-dione 5-chloro-2-(3,4-dihydro-1H-isochromen-3-ylmethyl)-3a,4,7,7a-tetrahydroisoindole-1,3-dione MLS000114342 cid_2930337
Type:
Small organic molecule
Emp. Form.:
C18H18ClNO3
Mol. Mass.:
331.793
SMILES:
ClC1=CCC2C(C1)C(=O)N(CC1Cc3ccccc3CO1)C2=O
: