Target
Neuropeptide Y receptor type 1
Ligand
BDBM50017698
Substrate
Meas. Tech.
Dose response counterscreen for neuropeptide Y receptor Y2 (NPY-Y2): Cell-based high throughput assay to measure NPY-Y1 antagonism
IC50
>35000±n/a nM
Citation
 PubChem, PC Dose response counterscreen for neuropeptide Y receptor Y2 (NPY-Y2): Cell-based high throughput assay to measure NPY-Y1 antagonism PubChem Bioassay (2008)[AID] 
Target
Name:
Neuropeptide Y receptor type 1
Synonyms:
NPY-Y1 NPY1R NPYR neuropeptide Y receptor Y1
Type:
Enzyme Catalytic Domain
Mol. Mass.:
44399.07
Organism:
Homo sapiens (Human)
Description:
NPY-Y1 NPY1R HUMAN::P25929
Residue:
384
  
Inhibitor
Name:
BDBM50017698
Synonyms:
4-(4-(4-chlorophenyl)-4-hydroxypiperidin-1-yl)-N,N-dimethyl-2,2-diphenylbutanamide 4-[4-(4-Chloro-phenyl)-4-hydroxy-piperidin-1-yl]-N,N-dimethyl-2,2-diphenyl-butyramide(loperamide) Imodium LOPERAMIDE HYDROCHLORIDE med.21724, Compound 184
Type:
Small organic molecule
Emp. Form.:
C29H33ClN2O2
Mol. Mass.:
477.038
SMILES:
CN(C)C(=O)C(CCN1CCC(O)(CC1)c1ccc(Cl)cc1)(c1ccccc1)c1ccccc1
: