Target
Neuropeptide Y receptor type 1
Ligand
BDBM42487
Substrate
Meas. Tech.
Dose response counterscreen for neuropeptide Y receptor Y2 (NPY-Y2): Cell-based high throughput assay to measure NPY-Y1 antagonism
IC50
11150±n/a nM
Citation
 PubChem, PC Dose response counterscreen for neuropeptide Y receptor Y2 (NPY-Y2): Cell-based high throughput assay to measure NPY-Y1 antagonism PubChem Bioassay (2008)[AID] 
Target
Name:
Neuropeptide Y receptor type 1
Synonyms:
NPY-Y1 NPY1R NPYR neuropeptide Y receptor Y1
Type:
Enzyme Catalytic Domain
Mol. Mass.:
44399.07
Organism:
Homo sapiens (Human)
Description:
NPY-Y1 NPY1R HUMAN::P25929
Residue:
384
  
Inhibitor
Name:
BDBM42487
Synonyms:
2-(ethylthio)-6-methoxy-3-quinolinecarbonitrile 2-ethylsulfanyl-6-methoxy-quinoline-3-carbonitrile MLS000120924 cid_865459
Type:
Small organic molecule
Emp. Form.:
C13H12N2OS
Mol. Mass.:
244.312
SMILES:
CCSc1nc2ccc(OC)cc2cc1C#N
: