Target
Neuropeptide Y receptor type 1
Ligand
BDBM42507
Substrate
Meas. Tech.
Dose response counterscreen for neuropeptide Y receptor Y2 (NPY-Y2): Cell-based high throughput assay to measure NPY-Y1 antagonism
IC50
5210±n/a nM
Citation
 PubChem, PC Dose response counterscreen for neuropeptide Y receptor Y2 (NPY-Y2): Cell-based high throughput assay to measure NPY-Y1 antagonism PubChem Bioassay (2008)[AID] 
Target
Name:
Neuropeptide Y receptor type 1
Synonyms:
NPY-Y1 NPY1R NPYR neuropeptide Y receptor Y1
Type:
Enzyme Catalytic Domain
Mol. Mass.:
44399.07
Organism:
Homo sapiens (Human)
Description:
NPY-Y1 NPY1R HUMAN::P25929
Residue:
384
  
Inhibitor
Name:
BDBM42507
Synonyms:
5-[[(4-keto-3-phenyl-quinazolin-2-yl)thio]methyl]furan-2-carboxylic acid methyl ester MLS000566237 cid_2609912 methyl 5-[(4-oxo-3-phenylquinazolin-2-yl)sulfanylmethyl]furan-2-carboxylate
Type:
Small organic molecule
Emp. Form.:
C21H16N2O4S
Mol. Mass.:
392.428
SMILES:
COC(=O)c1ccc(CSc2nc3ccccc3c(=O)n2-c2ccccc2)o1
: