Target
Neuropeptide Y receptor type 1
Ligand
BDBM42512
Substrate
Meas. Tech.
Dose response counterscreen for neuropeptide Y receptor Y2 (NPY-Y2): Cell-based high throughput assay to measure NPY-Y1 antagonism
IC50
<12000±n/a nM
Citation
 PubChem, PC Dose response counterscreen for neuropeptide Y receptor Y2 (NPY-Y2): Cell-based high throughput assay to measure NPY-Y1 antagonism PubChem Bioassay (2008)[AID] 
Target
Name:
Neuropeptide Y receptor type 1
Synonyms:
NPY-Y1 NPY1R NPYR neuropeptide Y receptor Y1
Type:
Enzyme Catalytic Domain
Mol. Mass.:
44399.07
Organism:
Homo sapiens (Human)
Description:
NPY-Y1 NPY1R HUMAN::P25929
Residue:
384
  
Inhibitor
Name:
BDBM42512
Synonyms:
(5,5-Diphenyl-hex-2-ynyl)-diethyl-amine MLS000563260 N,N-diethyl-5,5-diphenyl-hex-2-yn-1-amine;hydrochloride SMR000177913 | cid_11957324
Type:
Small organic molecule
Emp. Form.:
C22H27N
Mol. Mass.:
305.4565
SMILES:
CCN(CC)CC#CCC(C)(c1ccccc1)c1ccccc1
: