Target
Neuropeptide Y receptor type 1
Ligand
BDBM42519
Substrate
Meas. Tech.
Dose response counterscreen for neuropeptide Y receptor Y2 (NPY-Y2): Cell-based high throughput assay to measure NPY-Y1 antagonism
IC50
6943±n/a nM
Citation
 PubChem, PC Dose response counterscreen for neuropeptide Y receptor Y2 (NPY-Y2): Cell-based high throughput assay to measure NPY-Y1 antagonism PubChem Bioassay (2008)[AID] 
Target
Name:
Neuropeptide Y receptor type 1
Synonyms:
NPY-Y1 NPY1R NPYR neuropeptide Y receptor Y1
Type:
Enzyme Catalytic Domain
Mol. Mass.:
44399.07
Organism:
Homo sapiens (Human)
Description:
NPY-Y1 NPY1R HUMAN::P25929
Residue:
384
  
Inhibitor
Name:
BDBM42519
Synonyms:
MLS000546241 N-(4-chlorophenyl)-2-phenyl-4-thiazolecarboxamide SMR000169411 | cid_2744454
Type:
Small organic molecule
Emp. Form.:
C16H11ClN2OS
Mol. Mass.:
314.789
SMILES:
Clc1ccc(NC(=O)c2csc(n2)-c2ccccc2)cc1
: