Target
Neuropeptide Y receptor type 1
Ligand
BDBM42539
Substrate
Meas. Tech.
Dose response counterscreen for neuropeptide Y receptor Y2 (NPY-Y2): Cell-based high throughput assay to measure NPY-Y1 antagonism
IC50
>35000±n/a nM
Citation
 PubChem, PC Dose response counterscreen for neuropeptide Y receptor Y2 (NPY-Y2): Cell-based high throughput assay to measure NPY-Y1 antagonism PubChem Bioassay (2008)[AID] 
Target
Name:
Neuropeptide Y receptor type 1
Synonyms:
NPY-Y1 NPY1R NPYR neuropeptide Y receptor Y1
Type:
Enzyme Catalytic Domain
Mol. Mass.:
44399.07
Organism:
Homo sapiens (Human)
Description:
NPY-Y1 NPY1R HUMAN::P25929
Residue:
384
  
Inhibitor
Name:
BDBM42539
Synonyms:
4-(Hydroxy-diphenyl-methyl)-piperidine-1-carbothioic acid (4-ethoxy-phenyl)-amide MLS000569101 N-(4-ethoxyphenyl)-4-[hydroxy(diphenyl)methyl]piperidine-1-carbothioamide SMR000177227 | cid_2936384
Type:
Small organic molecule
Emp. Form.:
C27H30N2O2S
Mol. Mass.:
446.604
SMILES:
CCOc1ccc(NC(=S)N2CCC(CC2)C(O)(c2ccccc2)c2ccccc2)cc1
: