Target
Neuropeptide Y receptor type 1
Ligand
BDBM42540
Substrate
Meas. Tech.
Dose response counterscreen for neuropeptide Y receptor Y2 (NPY-Y2): Cell-based high throughput assay to measure NPY-Y1 antagonism
IC50
6324±n/a nM
Citation
 PubChem, PC Dose response counterscreen for neuropeptide Y receptor Y2 (NPY-Y2): Cell-based high throughput assay to measure NPY-Y1 antagonism PubChem Bioassay (2008)[AID] 
Target
Name:
Neuropeptide Y receptor type 1
Synonyms:
NPY-Y1 NPY1R NPYR neuropeptide Y receptor Y1
Type:
Enzyme Catalytic Domain
Mol. Mass.:
44399.07
Organism:
Homo sapiens (Human)
Description:
NPY-Y1 NPY1R HUMAN::P25929
Residue:
384
  
Inhibitor
Name:
BDBM42540
Synonyms:
1-(2-Dimethylamino-ethyl)-1-(6,8-dimethyl-2-oxo-1,2-dihydro-quinolin-3-ylmethyl)-3-m-tolyl-thiourea 1-[2-(dimethylamino)ethyl]-1-[(6,8-dimethyl-2-oxidanylidene-1H-quinolin-3-yl)methyl]-3-(3-methylphenyl)thiourea MLS000554607 cid_1141823
Type:
Small organic molecule
Emp. Form.:
C24H30N4OS
Mol. Mass.:
422.586
SMILES:
CN(C)CCN(Cc1cc2cc(C)cc(C)c2[nH]c1=O)C(=S)Nc1cccc(C)c1
: