Target
Neuropeptide Y receptor type 1
Ligand
BDBM42543
Substrate
Meas. Tech.
Dose response counterscreen for neuropeptide Y receptor Y2 (NPY-Y2): Cell-based high throughput assay to measure NPY-Y1 antagonism
IC50
10390±n/a nM
Citation
 PubChem, PC Dose response counterscreen for neuropeptide Y receptor Y2 (NPY-Y2): Cell-based high throughput assay to measure NPY-Y1 antagonism PubChem Bioassay (2008)[AID] 
Target
Name:
Neuropeptide Y receptor type 1
Synonyms:
NPY-Y1 NPY1R NPYR neuropeptide Y receptor Y1
Type:
Enzyme Catalytic Domain
Mol. Mass.:
44399.07
Organism:
Homo sapiens (Human)
Description:
NPY-Y1 NPY1R HUMAN::P25929
Residue:
384
  
Inhibitor
Name:
BDBM42543
Synonyms:
2-[(4-acetamidophenyl)sulfonyl-(2-phenylethyl)amino]-N-[(3,4-dimethoxyphenyl)methylideneamino]acetamide 2-[(4-acetamidophenyl)sulfonyl-phenethyl-amino]-N-(veratrylideneamino)acetamide N-{4-[(3,4-Dimethoxy-benzylidene-hydrazinocarbonylmethyl)-phenethyl-sulfamoyl]-phenyl}-acetamide cid_3130086
Type:
Small organic molecule
Emp. Form.:
C27H30N4O6S
Mol. Mass.:
538.615
SMILES:
COc1ccc(C=NNC(=O)CN(CCc2ccccc2)S(=O)(=O)c2ccc(NC(C)=O)cc2)cc1OC
: