Target
Neuropeptide Y receptor type 1
Ligand
BDBM42544
Substrate
Meas. Tech.
Dose response counterscreen for neuropeptide Y receptor Y2 (NPY-Y2): Cell-based high throughput assay to measure NPY-Y1 antagonism
IC50
13630±n/a nM
Citation
 PubChem, PC Dose response counterscreen for neuropeptide Y receptor Y2 (NPY-Y2): Cell-based high throughput assay to measure NPY-Y1 antagonism PubChem Bioassay (2008)[AID] 
Target
Name:
Neuropeptide Y receptor type 1
Synonyms:
NPY-Y1 NPY1R NPYR neuropeptide Y receptor Y1
Type:
Enzyme Catalytic Domain
Mol. Mass.:
44399.07
Organism:
Homo sapiens (Human)
Description:
NPY-Y1 NPY1R HUMAN::P25929
Residue:
384
  
Inhibitor
Name:
BDBM42544
Synonyms:
3-(4-butoxyphenyl)-4,5-dihydro-1H-pyridazin-6-one MLS000584700 cid_12004848
Type:
Small organic molecule
Emp. Form.:
C14H18N2O2
Mol. Mass.:
246.3049
SMILES:
CCCCOc1ccc(cc1)C1=NNC(=O)CC1
: