Target
Neuropeptide Y receptor type 1
Ligand
BDBM42558
Substrate
Meas. Tech.
Dose response counterscreen for neuropeptide Y receptor Y2 (NPY-Y2): Cell-based high throughput assay to measure NPY-Y1 antagonism
IC50
7704±n/a nM
Citation
 PubChem, PC Dose response counterscreen for neuropeptide Y receptor Y2 (NPY-Y2): Cell-based high throughput assay to measure NPY-Y1 antagonism PubChem Bioassay (2008)[AID] 
Target
Name:
Neuropeptide Y receptor type 1
Synonyms:
NPY-Y1 NPY1R NPYR neuropeptide Y receptor Y1
Type:
Enzyme Catalytic Domain
Mol. Mass.:
44399.07
Organism:
Homo sapiens (Human)
Description:
NPY-Y1 NPY1R HUMAN::P25929
Residue:
384
  
Inhibitor
Name:
BDBM42558
Synonyms:
4-[[2-(2-chlorophenyl)-5-methyl-4-oxazolyl]methyl]-5-furo[3,2-b]pyrrolecarboxylic acid methyl ester MLS000586908 cid_15944687 methyl 4-{[2-(2-chlorophenyl)-5-methyl-1,3-oxazol-4-yl]methyl}-4H-furo[3,2-b]pyrrole-5-carboxylate
Type:
Small organic molecule
Emp. Form.:
C19H15ClN2O4
Mol. Mass.:
370.786
SMILES:
COC(=O)c1cc2occc2n1Cc1nc(oc1C)-c1ccccc1Cl
: