Target
Dimer of Gag-Pol polyprotein [489-587]
Ligand
BDBM1924
Substrate
Peptide Substrate
Meas. Tech.
Protease Inhibition Assay
pH
5±n/a
Temperature
295.15±n/a K
Ki
160±n/a nM
Citation
 Thaisrivongs, SWatenpaugh, KDHowe, WJTomich, PKDolak, LAChong, KTTomich, CCTomasselli, AGTurner, SRStrohbach, JW Structure-based design of novel HIV protease inhibitors: carboxamide-containing 4-hydroxycoumarins and 4-hydroxy-2-pyrones as potent nonpeptidic inhibitors. J Med Chem 38:3624-37 (1995)  
Target
Name:
Dimer of Gag-Pol polyprotein [489-587]
Synonyms:
HIV-1 Protease
Type:
Protein Complex
Mol. Mass.:
Description:
Components:
This complex has 2 components.
Component 1
Name:
Gag-Pol polyprotein [489-587]
Synonyms:
HIV protease HIV-1 Protease chain A POL_HV1N5 | gag-pol
Type:
Enzyme Subunit
Mol. Mass.:
10822.21
Organism:
Human immunodeficiency virus type 1
Description:
P12497[489-587]
Residue:
99
  
Component 2
Name:
Gag-Pol polyprotein [489-587]
Synonyms:
HIV protease HIV-1 Protease chain A POL_HV1N5 | gag-pol
Type:
Enzyme Subunit
Mol. Mass.:
10822.21
Organism:
Human immunodeficiency virus type 1
Description:
P12497[489-587]
Residue:
99
  
Inhibitor
Name:
BDBM1924
Synonyms:
4-Hydroxy-3-[1-[3-[[[[(tert-butyloxycarbonyl)amino]methyl]carbonyl]amino]phenyl]propyl]coumarin tert-butyl N-[({3-[(1S)-1-(4-hydroxy-2-oxo-2H-chromen-3-yl)propyl]phenyl}carbamoyl)methyl]carbamate
Type:
Small organic molecule
Emp. Form.:
C25H28N2O6
Mol. Mass.:
452.4996
SMILES:
CC[C@@H](c1cccc(NC(=O)CNC(=O)OC(C)(C)C)c1)c1c(O)c2ccccc2oc1=O
:
Substrate
Name:
Peptide Substrate
Synonyms:
Type:
Peptide
Mol. Mass.:
1447.64
Organism:
Description:
The peptide was derivatized with biotin and fluorescein isothiocyanate at the amino and carboxy termini.
Residue:
12
RVSQNYPIVQNK