Target
Dimer of Gag-Pol polyprotein [489-587]
Ligand
BDBM1935
Substrate
Peptide Substrate
Meas. Tech.
Protease Inhibition Assay
pH
5±n/a
Temperature
295.15±n/a K
Ki
28±n/a nM
Citation
 Thaisrivongs, SWatenpaugh, KDHowe, WJTomich, PKDolak, LAChong, KTTomich, CCTomasselli, AGTurner, SRStrohbach, JW Structure-based design of novel HIV protease inhibitors: carboxamide-containing 4-hydroxycoumarins and 4-hydroxy-2-pyrones as potent nonpeptidic inhibitors. J Med Chem 38:3624-37 (1995)  
Target
Name:
Dimer of Gag-Pol polyprotein [489-587]
Synonyms:
HIV-1 Protease
Type:
Protein Complex
Mol. Mass.:
Description:
Components:
This complex has 2 components.
Component 1
Name:
Gag-Pol polyprotein [489-587]
Synonyms:
HIV protease HIV-1 Protease chain A POL_HV1N5 | gag-pol
Type:
Enzyme Subunit
Mol. Mass.:
10822.21
Organism:
Human immunodeficiency virus type 1
Description:
P12497[489-587]
Residue:
99
  
Component 2
Name:
Gag-Pol polyprotein [489-587]
Synonyms:
HIV protease HIV-1 Protease chain A POL_HV1N5 | gag-pol
Type:
Enzyme Subunit
Mol. Mass.:
10822.21
Organism:
Human immunodeficiency virus type 1
Description:
P12497[489-587]
Residue:
99
  
Inhibitor
Name:
BDBM1935
Synonyms:
Carboxamide-Containing 4-Hydroxycoumarin analogue XVI tert-butyl N-[2-({3-[cyclopropyl(4-hydroxy-7-methoxy-2-oxo-2H-chromen-3-yl)methyl]phenyl}carbamoyl)ethyl]carbamate
Type:
Small organic molecule
Emp. Form.:
C28H32N2O7
Mol. Mass.:
508.5629
SMILES:
COc1ccc2c(O)c(C(C3CC3)c3cccc(NC(=O)CCNC(=O)OC(C)(C)C)c3)c(=O)oc2c1
:
Substrate
Name:
Peptide Substrate
Synonyms:
Type:
Peptide
Mol. Mass.:
1447.64
Organism:
Description:
The peptide was derivatized with biotin and fluorescein isothiocyanate at the amino and carboxy termini.
Residue:
12
RVSQNYPIVQNK