Target
GTPase KRas [1-37]
Ligand
BDBM43250
Substrate
Meas. Tech.
Multiplexed dose response to identify specific small molecule inhibitors of Ras and Ras-related GTPases specifically Ras wildtype
EC50
2610±n/a nM
Citation
 PubChem, PC Multiplexed dose response to identify specific small molecule inhibitors of Ras and Ras-related GTPases specifically Ras wildtype PubChem Bioassay (2010)[AID] 
Target
Name:
GTPase KRas [1-37]
Synonyms:
ras protein
Type:
Enzyme Catalytic Domain
Mol. Mass.:
4034.04
Organism:
Homo sapiens (Human)
Description:
gi_190938
Residue:
37
  
Inhibitor
Name:
BDBM43250
Synonyms:
MLS000680398 N-[3-[2-ethylsulfonyl-3-(4-methylphenyl)-3,4-dihydropyrazol-5-yl]phenyl]methanesulfonamide cid_3554496
Type:
Small organic molecule
Emp. Form.:
C19H23N3O4S2
Mol. Mass.:
421.534
SMILES:
CCS(=O)(=O)N1N=C(CC1c1ccc(C)cc1)c1cccc(NS(C)(=O)=O)c1
: