Target
Multidrug resistance-associated protein 1
Ligand
BDBM40570
Substrate
Meas. Tech.
Identification of Molecular Probes that Activate MRP-1 - Dose Response
EC50
1126±n/a nM
Citation
 PubChem, PC Identification of Molecular Probes that Activate MRP-1 - Dose Response PubChem Bioassay (2007)[AID] 
Target
Name:
Multidrug resistance-associated protein 1
Synonyms:
7.6.2.2 ABCC1 ATP-binding cassette, sub-family C, member 1 isoform 1 LTC4 transporter MRP MRP1_HUMAN
Type:
Mol. Mass.:
171597.72
Organism:
Homo sapiens (Human)
Description:
P33527
Residue:
1531
  
Inhibitor
Name:
BDBM40570
Synonyms:
2-(2-furanyl)-2,3-dihydro-1H-perimidine 2-(furan-2-yl)-2,3-dihydro-1H-perimidine MLS000031215 cid_647027
Type:
Small organic molecule
Emp. Form.:
C15H12N2O
Mol. Mass.:
236.2686
SMILES:
N1C(Nc2cccc3cccc1c23)c1ccco1
: