Target
Multidrug resistance-associated protein 1
Ligand
BDBM44708
Substrate
Meas. Tech.
Identification of Molecular Probes that Activate MRP-1 - Dose Response
EC50
5396±n/a nM
Citation
 PubChem, PC Identification of Molecular Probes that Activate MRP-1 - Dose Response PubChem Bioassay (2007)[AID] 
Target
Name:
Multidrug resistance-associated protein 1
Synonyms:
7.6.2.2 ABCC1 ATP-binding cassette, sub-family C, member 1 isoform 1 LTC4 transporter MRP MRP1_HUMAN
Type:
Mol. Mass.:
171597.72
Organism:
Homo sapiens (Human)
Description:
P33527
Residue:
1531
  
Inhibitor
Name:
BDBM44708
Synonyms:
MLS000118845 N-(4-ethylphenyl)-2-(6-morpholin-4-ylsulfonyl-2-oxidanylidene-1,3-benzoxazol-3-yl)ethanamide N-(4-ethylphenyl)-2-[6-(4-morpholinylsulfonyl)-2-oxo-1,3-benzoxazol-3-yl]acetamide cid_5307802
Type:
Small organic molecule
Emp. Form.:
C21H23N3O6S
Mol. Mass.:
445.489
SMILES:
CCc1ccc(NC(=O)Cn2c3ccc(cc3oc2=O)S(=O)(=O)N2CCOCC2)cc1
: