Target
Multidrug resistance-associated protein 1
Ligand
BDBM45146
Substrate
Meas. Tech.
Identification of Molecular Probes that Activate MRP-1 - Dose Response
EC50
717±n/a nM
Citation
 PubChem, PC Identification of Molecular Probes that Activate MRP-1 - Dose Response PubChem Bioassay (2007)[AID] 
Target
Name:
Multidrug resistance-associated protein 1
Synonyms:
7.6.2.2 ABCC1 ATP-binding cassette, sub-family C, member 1 isoform 1 LTC4 transporter MRP MRP1_HUMAN
Type:
Mol. Mass.:
171597.72
Organism:
Homo sapiens (Human)
Description:
P33527
Residue:
1531
  
Inhibitor
Name:
BDBM45146
Synonyms:
2-[3-(7-Methyl-indolo[2,3-b]quinoxalin-6-yl)-propyl]-isoindole-1,3-dione 2-[3-(7-methylindolo[3,2-b]quinoxalin-6-yl)propyl]isoindole-1,3-dione MLS000588559 cid_1993618
Type:
Small organic molecule
Emp. Form.:
C26H20N4O2
Mol. Mass.:
420.4626
SMILES:
Cc1cccc2c3nc4ccccc4nc3n(CCCN3C(=O)c4ccccc4C3=O)c12
: