Target
Multidrug resistance-associated protein 1
Ligand
BDBM45193
Substrate
Meas. Tech.
Identification of Molecular Probes that Activate MRP-1 - Dose Response
EC50
673±n/a nM
Citation
 PubChem, PC Identification of Molecular Probes that Activate MRP-1 - Dose Response PubChem Bioassay (2007)[AID] 
Target
Name:
Multidrug resistance-associated protein 1
Synonyms:
7.6.2.2 ABCC1 ATP-binding cassette, sub-family C, member 1 isoform 1 LTC4 transporter MRP MRP1_HUMAN
Type:
Mol. Mass.:
171597.72
Organism:
Homo sapiens (Human)
Description:
P33527
Residue:
1531
  
Inhibitor
Name:
BDBM45193
Synonyms:
(3,5-Dimethyl-4-nitro-pyrazol-1-yl)-acetic acid [1-(2-hydroxy-3-methoxy-phenyl)-meth-(E)-ylidene]-hydrazide 2-(3,5-dimethyl-4-nitro-pyrazol-1-yl)-N'-[(E)-(5-methoxy-6-oxidanylidene-cyclohexa-2,4-dien-1-ylidene)methyl]ethanehydrazide 2-(3,5-dimethyl-4-nitropyrazol-1-yl)-N'-[(E)-(5-methoxy-6-oxocyclohexa-2,4-dien-1-ylidene)methyl]acetohydrazide SMR000219914 | cid_6538410
Type:
Small organic molecule
Emp. Form.:
C15H17N5O5
Mol. Mass.:
347.326
SMILES:
COc1cccc(\C=[NH+]\NC(=O)Cn2nc(C)c(c2C)[N+]([O-])=O)c1[O-]
: