Target
Coagulation factor XII
Ligand
BDBM32676
Substrate
Meas. Tech.
Factor XIIa 1536 HTS Dose Response Confirmation
IC50
1401.053333±134.421453 nM
Citation
 PubChem, PC Factor XIIa 1536 HTS Dose Response Confirmation PubChem Bioassay (2008)[AID] 
Target
Name:
Coagulation factor XII
Synonyms:
Beta-factor XIIa part 1 Carboxylesterase 2 (intestine, liver) Coagulation factor XII (FXII) Coagulation factor XIIa light chain FA12_HUMAN Factor XIIa (fXIIa) Hageman factor
Type:
Enzyme
Mol. Mass.:
67810.07
Organism:
Homo sapiens (Human)
Description:
P00748
Residue:
615
  
Inhibitor
Name:
BDBM32676
Synonyms:
(3-amino-1,2,4-triazol-4-yl)-(3,5-dimethylphenyl)methanone 4-(3,5-dimethylbenzoyl)-4H-1,2,4-triazol-3-amine SMR000075231 | cid_912604
Type:
Small organic molecule
Emp. Form.:
C11H12N4O
Mol. Mass.:
216.2392
SMILES:
Cc1cc(C)cc(c1)C(=O)n1cnnc1N
: