Target
Coagulation factor XII
Ligand
BDBM45587
Substrate
Meas. Tech.
Factor XIIa 1536 HTS Dose Response Confirmation
IC50
500.436667±84.268673 nM
Citation
 PubChem, PC Factor XIIa 1536 HTS Dose Response Confirmation PubChem Bioassay (2008)[AID] 
Target
Name:
Coagulation factor XII
Synonyms:
Beta-factor XIIa part 1 Carboxylesterase 2 (intestine, liver) Coagulation factor XII (FXII) Coagulation factor XIIa light chain FA12_HUMAN Factor XIIa (fXIIa) Hageman factor
Type:
Enzyme
Mol. Mass.:
67810.07
Organism:
Homo sapiens (Human)
Description:
P00748
Residue:
615
  
Inhibitor
Name:
BDBM45587
Synonyms:
(3-amino-1,2,4-triazol-4-yl)-(3-methylphenyl)methanone (3-azanyl-1,2,4-triazol-4-yl)-(3-methylphenyl)methanone MLS000662365 cid_894972
Type:
Small organic molecule
Emp. Form.:
C10H10N4O
Mol. Mass.:
202.2126
SMILES:
Cc1cccc(c1)C(=O)n1cnnc1N
: