Target
Coagulation factor XII
Ligand
BDBM33896
Substrate
Meas. Tech.
Factor XIIa 1536 HTS Dose Response Confirmation
IC50
29.633333±1.788472 nM
Citation
 PubChem, PC Factor XIIa 1536 HTS Dose Response Confirmation PubChem Bioassay (2008)[AID] 
Target
Name:
Coagulation factor XII
Synonyms:
Beta-factor XIIa part 1 Carboxylesterase 2 (intestine, liver) Coagulation factor XII (FXII) Coagulation factor XIIa light chain FA12_HUMAN Factor XIIa (fXIIa) Hageman factor
Type:
Enzyme
Mol. Mass.:
67810.07
Organism:
Homo sapiens (Human)
Description:
P00748
Residue:
615
  
Inhibitor
Name:
BDBM33896
Synonyms:
3-[(4-fluorobenzoyl)amino]-1H-1,2,4-triazole-5-carboxylic acid methyl ester MLS001007132 cid_2317506 methyl 3-[(4-fluorophenyl)carbonylamino]-1H-1,2,4-triazole-5-carboxylate
Type:
Small organic molecule
Emp. Form.:
C11H9FN4O3
Mol. Mass.:
264.2126
SMILES:
COC(=O)c1nnc(NC(=O)c2ccc(F)cc2)[nH]1
: