Target
Coagulation factor XII
Ligand
BDBM33004
Substrate
Meas. Tech.
Factor XIIa 1536 HTS Dose Response Confirmation
IC50
1784.073333±613.775732 nM
Citation
 PubChem, PC Factor XIIa 1536 HTS Dose Response Confirmation PubChem Bioassay (2008)[AID] 
Target
Name:
Coagulation factor XII
Synonyms:
Beta-factor XIIa part 1 Carboxylesterase 2 (intestine, liver) Coagulation factor XII (FXII) Coagulation factor XIIa light chain FA12_HUMAN Factor XIIa (fXIIa) Hageman factor
Type:
Enzyme
Mol. Mass.:
67810.07
Organism:
Homo sapiens (Human)
Description:
P00748
Residue:
615
  
Inhibitor
Name:
BDBM33004
Synonyms:
2-(2-Bromo-phenyl)-6-methyl-thieno[2,3-d][1,3]oxazin-4-one 2-(2-bromophenyl)-6-methyl-thieno[2,3-d][1,3]oxazin-4-one MLS000767779 cid_3796366
Type:
Small organic molecule
Emp. Form.:
C13H8BrNO2S
Mol. Mass.:
322.177
SMILES:
Cc1cc2c(nc(oc2=O)-c2ccccc2Br)s1
: