Target
Alkaline phosphatase, tissue-nonspecific isozyme
Ligand
BDBM41883
Substrate
Meas. Tech.
SAR analysis of an In Vitro TNAP Dose Response Luminescent Assay
IC50
3340±n/a nM
Citation
 PubChem, PC SAR analysis of an In Vitro TNAP Dose Response Luminescent Assay PubChem Bioassay (2010)[AID] 
Target
Name:
Alkaline phosphatase, tissue-nonspecific isozyme
Synonyms:
ALPL tissue-nonspecific alkaline phosphatase precursor
Type:
PROTEIN
Mol. Mass.:
57306.17
Organism:
Homo sapiens (Human)
Description:
ChEMBL_1448917
Residue:
524
  
Inhibitor
Name:
BDBM41883
Synonyms:
1-(3,4-dihydroxyphenyl)-2-[[5-(2-methoxyphenyl)-1H-1,2,4-triazol-3-yl]sulfanyl]ethanone 1-[3,4-bis(oxidanyl)phenyl]-2-[[5-(2-methoxyphenyl)-1H-1,2,4-triazol-3-yl]sulfanyl]ethanone cid_1314069
Type:
Small organic molecule
Emp. Form.:
C17H15N3O4S
Mol. Mass.:
357.384
SMILES:
COc1ccccc1-c1nnc(SCC(=O)c2ccc(O)c(O)c2)[nH]1
: