Target
Tyrosine-protein phosphatase non-receptor type 7
Ligand
BDBM31731
Substrate
Meas. Tech.
Fluorescent secondary assay for dose-response confirmation of chemical inhibitors of HePTP
IC50
2700±n/a nM
Citation
 PubChem, PC Fluorescent secondary assay for dose-response confirmation of chemical inhibitors of HePTP PubChem Bioassay (2009)[AID] 
Target
Name:
Tyrosine-protein phosphatase non-receptor type 7
Synonyms:
He-PTP Hematopoietic protein-tyrosine phosphatase (HEPTP) PTPN7 Tyrosine-protein phosphatase non-receptor type 7 | Tyrosine-protein phosphatase non-receptor type 7 (HEPTP)
Type:
Protein
Mol. Mass.:
40530.79
Organism:
Homo sapiens (Human)
Description:
P35236
Residue:
360
  
Inhibitor
Name:
BDBM31731
Synonyms:
4-[5-[(Z)-(1-ketothiazolo[3,2-a]benzimidazol-2-ylidene)methyl]-2-furyl]benzoic acid 4-[5-[(Z)-(1-oxo-2-thiazolo[3,2-a]benzimidazolylidene)methyl]-2-furanyl]benzoic acid MLS-0091939.0001 | cid_2243732
Type:
Small organic molecule
Emp. Form.:
C21H12N2O4S
Mol. Mass.:
388.396
SMILES:
OC(=O)c1ccc(cc1)-c1ccc(\C=c2/sc3nc4ccccc4n3c2=O)o1
: