Target
Tyrosine-protein phosphatase non-receptor type 7
Ligand
BDBM46182
Substrate
Meas. Tech.
Fluorescent secondary assay for dose-response confirmation of chemical inhibitors of HePTP
IC50
923±n/a nM
Citation
 PubChem, PC Fluorescent secondary assay for dose-response confirmation of chemical inhibitors of HePTP PubChem Bioassay (2009)[AID] 
Target
Name:
Tyrosine-protein phosphatase non-receptor type 7
Synonyms:
He-PTP Hematopoietic protein-tyrosine phosphatase (HEPTP) PTPN7 Tyrosine-protein phosphatase non-receptor type 7 | Tyrosine-protein phosphatase non-receptor type 7 (HEPTP)
Type:
Protein
Mol. Mass.:
40530.79
Organism:
Homo sapiens (Human)
Description:
P35236
Residue:
360
  
Inhibitor
Name:
BDBM46182
Synonyms:
MLS-0202046.0001 N-[2,3-bis(2-furyl)quinoxalin-6-yl]-3-phenyl-pyrrolidine-1-carboxamide N-[2,3-bis(furan-2-yl)quinoxalin-6-yl]-3-phenylpyrrolidine-1-carboxamide | cid_2925154
Type:
Small organic molecule
Emp. Form.:
C27H22N4O3
Mol. Mass.:
450.4886
SMILES:
O=C(Nc1ccc2nc(-c3ccco3)c(nc2c1)-c1ccco1)N1CCC(C1)c1ccccc1
: