Target
Tyrosine-protein phosphatase non-receptor type 7
Ligand
BDBM46190
Substrate
Meas. Tech.
Fluorescent secondary assay for dose-response confirmation of chemical inhibitors of HePTP
IC50
2170±n/a nM
Citation
 PubChem, PC Fluorescent secondary assay for dose-response confirmation of chemical inhibitors of HePTP PubChem Bioassay (2009)[AID] 
Target
Name:
Tyrosine-protein phosphatase non-receptor type 7
Synonyms:
He-PTP Hematopoietic protein-tyrosine phosphatase (HEPTP) PTPN7 Tyrosine-protein phosphatase non-receptor type 7 | Tyrosine-protein phosphatase non-receptor type 7 (HEPTP)
Type:
Protein
Mol. Mass.:
40530.79
Organism:
Homo sapiens (Human)
Description:
P35236
Residue:
360
  
Inhibitor
Name:
BDBM46190
Synonyms:
1-[2,3-bis(2-furanyl)-6-quinoxalinyl]-3-(2-hydroxyethyl)urea 1-[2,3-bis(furan-2-yl)quinoxalin-6-yl]-3-(2-hydroxyethyl)urea cid_3157646
Type:
Small organic molecule
Emp. Form.:
C19H16N4O4
Mol. Mass.:
364.3547
SMILES:
OCCNC(=O)Nc1ccc2nc(-c3ccco3)c(nc2c1)-c1ccco1
: