Target
Tyrosine-protein phosphatase non-receptor type 7
Ligand
BDBM46207
Substrate
Meas. Tech.
Fluorescent secondary assay for dose-response confirmation of chemical inhibitors of HePTP
IC50
274±n/a nM
Citation
 PubChem, PC Fluorescent secondary assay for dose-response confirmation of chemical inhibitors of HePTP PubChem Bioassay (2009)[AID] 
Target
Name:
Tyrosine-protein phosphatase non-receptor type 7
Synonyms:
He-PTP Hematopoietic protein-tyrosine phosphatase (HEPTP) PTPN7 Tyrosine-protein phosphatase non-receptor type 7 | Tyrosine-protein phosphatase non-receptor type 7 (HEPTP)
Type:
Protein
Mol. Mass.:
40530.79
Organism:
Homo sapiens (Human)
Description:
P35236
Residue:
360
  
Inhibitor
Name:
BDBM46207
Synonyms:
4-[[5-(4-bromophenyl)-2-furoyl]thiocarbamoylamino]benzoic acid 4-[[5-(4-bromophenyl)furan-2-yl]carbonylcarbamothioylamino]benzoic acid MLS-0383777.0001 | cid_1328767
Type:
Small organic molecule
Emp. Form.:
C19H13BrN2O4S
Mol. Mass.:
445.287
SMILES:
OC(=O)c1ccc(NC(=S)NC(=O)c2ccc(o2)-c2ccc(Br)cc2)cc1
: