Target
Tyrosine-protein phosphatase non-receptor type 7
Ligand
BDBM46212
Substrate
Meas. Tech.
Fluorescent secondary assay for dose-response confirmation of chemical inhibitors of HePTP
IC50
276±n/a nM
Citation
 PubChem, PC Fluorescent secondary assay for dose-response confirmation of chemical inhibitors of HePTP PubChem Bioassay (2009)[AID] 
Target
Name:
Tyrosine-protein phosphatase non-receptor type 7
Synonyms:
He-PTP Hematopoietic protein-tyrosine phosphatase (HEPTP) PTPN7 Tyrosine-protein phosphatase non-receptor type 7 | Tyrosine-protein phosphatase non-receptor type 7 (HEPTP)
Type:
Protein
Mol. Mass.:
40530.79
Organism:
Homo sapiens (Human)
Description:
P35236
Residue:
360
  
Inhibitor
Name:
BDBM46212
Synonyms:
2-[2-chloranyl-6-methoxy-4-[(Z)-[3-[2-[(4-methylphenyl)amino]-2-oxidanylidene-ethyl]-2,4-bis(oxidanylidene)-1,3-thiazolidin-5-ylidene]methyl]phenoxy]ethanoic acid 2-[2-chloro-6-methoxy-4-[(Z)-[3-[2-(4-methylanilino)-2-oxoethyl]-2,4-dioxo-1,3-thiazolidin-5-ylidene]methyl]phenoxy]acetic acid MLS-0350105.0001 | cid_9512029
Type:
Small organic molecule
Emp. Form.:
C22H19ClN2O7S
Mol. Mass.:
490.913
SMILES:
COc1cc(\C=C2/SC(=O)N(CC(=O)Nc3ccc(C)cc3)C2=O)cc(Cl)c1OCC(O)=O
: